{"text_format":"1","workbook":"xlsx","n_sheets":8,"sheets":["Listado","Datos","Rendimientos","Imágenes 2D","Imágenes 3D","Índice sistemas","Estructura simple una placa","Estructura simple dos placas"],"not_rendered":{"charts":0,"images":45,"macros":1,"external_links":0,"defined_names":4,"comments":3,"pivot_tables":0},"unopened":[],"bounds":{"document_bytes":16777216,"sheet_cells":100000,"rows_first":2000,"rows_last":500,"rows_between":2000,"halvings":0,"cell_chars":16384,"cell_head_chars":4096},"cells_cut":0,"cells_raw":0,"read":"whole","date_system":"1900"}

{"sheet":"Listado","index":0,"n_rows":50,"n_cols":11,"rows_kept":50,"cut":false,"hidden":true,"merged":[[0,0,0,8],[1,0,1,8]]}
["ELEMENTOS SISTEMA"]
["LISTADO MATRIZ"]
[]
["CÓDIGO ARTÍCULO","DESCRIPCIÓN","COD.ARTICULO","T.M","ALTO","LARGO","UNI.CAJA","CAJAS/PALE","PREC.VENTA "]
["040113","PLACA ATT BASIC 13X600X1200 (78)","040113",3,0.6,1.2,1,78,6.36]
["040115","PLACA ATT BASIC 15X600X1200 (66)","040115",3,0.6,1.2,1,66,7.58]
{"$rows_left_out":45}
{"sheet":"Datos","index":1,"n_rows":16,"n_cols":3,"rows_kept":16,"cut":false,"hidden":false,"merged":[[0,2,0,5],[1,2,1,5],[5,0,5,1],[8,0,8,1],[9,0,9,1],[4,0,4,1],[4,2,4,5],[5,2,5,5],[6,2,6,5],[7,2,7,5],[8,2,8,5],[9,2,9,5],[15,0,15,1],[13,0,13,1],[7,0,7,1],[6,0,6,1],[0,0,1,0],[10,0,10,1],[11,0,11,1],[12,0,12,1],[14,0,14,1],[15,2,15,5],[10,2,10,5],[11,2,11,5],[12,2,12,5],[13,2,13,5],[14,2,14,5]]}
[null,null,"RENDIMIENTO DE MATERIALES POR M2 DE OBRA"]
[null,null,"DATOS PROGRAMABLES POR USUARIO"]
[]
[]
["CÓDIGO",null,"DESCRIPCIÓN"]
[30,null,"DESCUENTO EN PLACA (%)"]
{"$rows_left_out":11}
{"sheet":"Rendimientos","index":2,"n_rows":141,"n_cols":7,"rows_kept":141,"cut":false,"hidden":true,"merged":[[0,0,0,5],[1,0,1,5]]}
["RENDIMIENTO DE MATERIALES POR M2 DE OBRA"]
["CUBICACIONES PARA TRASDOSADO "]
[]
["CODIGO",null,"MATERIALES","UD","CANTIDAD por m2","PIEZA"]
[null,null,"PLACA","m2",1.02]
[null,null,"HORQUILLA","ud",3,100]
{"$rows_left_out":136}
{"sheet":"Imágenes 2D","index":3,"n_rows":6,"n_cols":15,"rows_kept":6,"cut":false,"hidden":true,"merged":[]}
[]
[null,1,2,3,4,5,6,2,3,4,null,1,2,3,4]
["Techo simple placa simple"]
[]
[null,1,2,3,4,5,6,2,3,4,null,1,2,3,4]
["Techo simple placa doble"]
{"$rows_left_out":1}
{"sheet":"Imágenes 3D","index":4,"n_rows":6,"n_cols":17,"rows_kept":6,"cut":false,"hidden":true,"merged":[]}
[]
[null,1,2,3,4,5,6,null,1,2,3,4,null,1,2,3,4]
["Techo doble placa simple"]
[]
[null,1,2,3,4,5,6,null,1,2,3,4,null,1,2,3,4]
["Techo doble placa doble"]
{"$rows_left_out":1}
{"sheet":"Índice sistemas","index":5,"n_rows":28,"n_cols":14,"rows_kept":28,"cut":false,"hidden":false,"merged":[[4,0,10,0],[11,0,17,0],[0,0,2,1],[4,1,10,1],[11,1,17,1]]}
[]
[]
[]
[null,"ESTRUCTURA SIMPLE","CÓDIGO","ID","SISTEMAS","M","M","P","Descripción Basic","Descripción Hidro","Descripción Fuego","Descripción Resist","Descripción HidroPlus","Descripción Suprem"]
["PLACA SIMPLE",null,{"$f":"F5*100+G5*100+H5","v":44713},"1.1.1","TECHO SIMPLE / ESTRUCTURA SIMPLE ATT® 47 / 400 1x13 ",400,47,13,"Techo continuo formado por una placa BASIC de 13 mm de espesor compuesta por yeso natural, fibra de vidrio y aditivos inorgánicos que le aportan alta dureza y resistencia mecánica. Reacción al fuego: EUROCLASE A1. Sistema de galces desiguales: las placas encajan entre ellas dejando una entrecalle de 3 mm por donde se inserte la pasta de juntas. Este sistema no utiliza cinta de papel. La pasta de juntas se aplica en las cavidades de las placas y una masilla elástica en los encuentros. Suspendido mediante una estructura simple de perfiles TC47 en acero galvanizado de 0,6 mm de espesor con modulación de 400 mm entre ejes y unidos al forjado mediante varilla roscada galvanizada y horquilla TC47. Incluida la parte proporcional del resto de materiales: tornillería, pasta de juntas, masilla para encuentros perimetrales, fijaciones, junta estanca, etc. Montaje según norma de instalación UNE 102043 y exigencias del CTE.","Techo continuo formado por una placa HIDRO de 13 mm de espesor compuesta por yeso natural, fibra de vidrio y aditivos inorgánicos que le aportan alta dureza y resistencia mecánica. Incorpora tratamiento hidrófugo, disminuyendo así, su capacidad de absorción de agua (menor al 5%). Idónea para proteger las estancias de los efectos adversos de la humedad. Reacción al fuego: EUROCLASE A1. Sistema de galces desiguales: las placas encajan entre ellas dejando una entrecalle de 3 mm por donde se inserte la pasta de juntas. Este sistema no utiliza cinta de papel. La pasta de juntas se aplica en las cavidades de las placas y una masilla elástica en los encuentros. Suspendido mediante una estructura simple de perfiles TC47 en acero galvanizado de 0,6 mm de espesor con modulación de 400 mm entre ejes y unidos al forjado mediante varilla roscada galvanizada y horquilla TC47. Incluida la parte proporcional del resto de materiales: tornillería, pasta de juntas, masilla para encuentros perimetrales, fijaciones, junta estanca, etc. Montaje según norma de instalación UNE 102043 y exigencias del CTE.","Techo continuo formado por una placa FUEGO de 13 mm de espesor compuesta por yeso natural, fibra de vidrio y aditivos inorgánicos que le aportan alta dureza y resistencia mecánica. Incorpora perlita y un aumento en la densidad que la hace idónea para un excelente comportamiento y resistencia frente al fuego. Reacción al fuego: EUROCLASE A1. Sistema de galces desiguales: las placas encajan entre ellas dejando una entrecalle de 3 mm por donde se inserte la pasta de juntas. Este sistema no utiliza cinta de papel. La pasta de juntas se aplica en las cavidades de las placas y una masilla elástica en los encuentros. Suspendido mediante una estructura simple de perfiles TC47 en acero galvanizado de 0,6 mm de espesor con modulación de 400 mm entre ejes y unidos al forjado mediante varilla roscada galvanizada y horquilla TC47. Incluida la parte proporcional del resto de materiales: tornillería, pasta de juntas, masilla para encuentros perimetrales, fijaciones, junta estanca, etc. Montaje según norma de instalación UNE 102043 y exigencias del CTE.","Techo continuo formado por una placa RESIST de 13 mm de espesor compuesta por yeso natural, fibra de vidrio y aditivos inorgánicos que le aportan alta dureza y resistencia mecánica. Con mayor cantidad de fibra de vidrio y dosificación modificada, aumenta su densidad, mejorando notablemente la resistencia mecánica. Idónea para lugares con altas exigencias en cuanto a deterioro y desgaste. Reacción al fuego: EUROCLASE A1. Sistema de galces desiguales: las placas encajan entre ellas dejando una entrecalle de 3 mm por donde se inserte la pasta de juntas. Este sistema no utiliza cinta de papel. La pasta de juntas se aplica en las cavidades de las placas y una masilla elástica en los encuentros. Suspendido mediante una estructura simple de perfiles TC47 en acero galvanizado de 0,6 mm de espesor con modulación de 400 mm entre ejes y unidos al forjado mediante varilla roscada galvanizada y horquilla TC47. Incluida la parte proporcional del resto de materiales: tornillería, pasta de juntas, masilla para encuentros perimetrales, fijaciones, junta estanca, etc. Montaje según norma de instalación UNE 102043 y exigencias del CTE.","Techo continuo formado por una placa HIDROPLUS de 13 mm de espesor compuesta por yeso natural, fibra de vidrio y aditivos inorgánicos que le aportan alta dureza y resistencia mecánica. Incorpora tratamiento hidrófugo y un aumento en su densidad, características claves para una elevada resistencia a la humedad (absorción de agua menor al 3%) y una gran resistencia mecánica. Idónea para zonas de intemperie. Reacción al fuego: EUROCLASE A1. Sistema de galces desiguales: las placas encajan entre ellas dejando una entrecalle de 3 mm por donde se inserte la pasta de juntas. Este sistema no utiliza cinta de papel. La pasta de juntas se aplica en las cavidades de las placas y una masilla elástica en los encuentros. Suspendido mediante una estructura simple de perfiles TC47 en acero galvanizado de 0,6 mm de espesor con modulación de 400 mm entre ejes y unidos al forjado mediante varilla roscada galvanizada y horquilla TC47. Incluida la parte proporcional del resto de materiales: tornillería, pasta de juntas, masilla para encuentros perimetrales, fijaciones, junta estanca, etc. Montaje según norma de instalación UNE 102043 y exigencias del CTE.","Techo continuo formado por una placa SUPREM de 13 mm de espesor compuesta por yeso natural, fibra de vidrio y aditivos inorgánicos que le aportan alta dureza y resistencia mecánica. Incorpora tratamiento hidrófugo, perlita y un aumento en la densidad para conseguir soluciones constructivas que cumplan, altos requisitos frente al fuego y una capacidad reducida de absorción de agua. Reacción al fuego: EUROCLASE A1. Sistema de galces desiguales: las placas encajan entre ellas dejando una entrecalle de 3 mm por donde se inserte la pasta de juntas. Este sistema no utiliza cinta de papel. La pasta de juntas se aplica en las cavidades de las placas y una masilla elástica en los encuentros. Suspendido mediante una estructura simple de perfiles TC47 en acero galvanizado de 0,6 mm de espesor con modulación de 400 mm entre ejes y unidos al forjado mediante varilla roscada galvanizada y horquilla TC47. Incluida la parte proporcional del resto de materiales: tornillería, pasta de juntas, masilla para encuentros perimetrales, fijaciones, junta estanca, etc. Montaje según norma de instalación UNE 102043 y exigencias del CTE."]
[null,null,44715,"1.1.2","TECHO SIMPLE / ESTRUCTURA SIMPLE ATT® 47 / 400 1x15",400,47,15,"Techo continuo formado por una placa BASIC de 15 mm de espesor compuesta por yeso natural, fibra de vidrio y aditivos inorgánicos que le aportan alta dureza y resistencia mecánica. Reacción al fuego: EUROCLASE A1. Sistema de galces desiguales: las placas encajan entre ellas dejando una entrecalle de 3 mm por donde se inserte la pasta de juntas. Este sistema no utiliza cinta de papel. La pasta de juntas se aplica en las cavidades de las placas y una masilla elástica en los encuentros. Suspendido mediante una estructura simple de perfiles TC47 en acero galvanizado de 0,6 mm de espesor con modulación de 400 mm entre ejes y unidos al forjado mediante varilla roscada galvanizada y horquilla TC47. Incluida la parte proporcional del resto de materiales: tornillería, pasta de juntas, masilla para encuentros perimetrales, fijaciones, junta estanca, etc. Montaje según norma de instalación UNE 102043 y exigencias del CTE.","Techo continuo formado por una placa HIDRO de 15 mm de espesor compuesta por yeso natural, fibra de vidrio y aditivos inorgánicos que le aportan alta dureza y resistencia mecánica. Incorpora tratamiento hidrófugo, disminuyendo así, su capacidad de absorción de agua (menor al 5%). Idónea para proteger las estancias de los efectos adversos de la humedad. Reacción al fuego: EUROCLASE A1. Sistema de galces desiguales: las placas encajan entre ellas dejando una entrecalle de 3 mm por donde se inserte la pasta de juntas. Este sistema no utiliza cinta de papel. La pasta de juntas se aplica en las cavidades de las placas y una masilla elástica en los encuentros. Suspendido mediante una estructura simple de perfiles TC47 en acero galvanizado de 0,6 mm de espesor con modulación de 400 mm entre ejes y unidos al forjado mediante varilla roscada galvanizada y horquilla TC47. Incluida la parte proporcional del resto de materiales: tornillería, pasta de juntas, masilla para encuentros perimetrales, fijaciones, junta estanca, etc. Montaje según norma de instalación UNE 102043 y exigencias del CTE.","Techo continuo formado por una placa FUEGO de 15 mm de espesor compuesta por yeso natural, fibra de vidrio y aditivos inorgánicos que le aportan alta dureza y resistencia mecánica. Incorpora perlita y un aumento en la densidad que la hace idónea para un excelente comportamiento y resistencia frente al fuego. Reacción al fuego: EUROCLASE A1. Sistema de galces desiguales: las placas encajan entre ellas dejando una entrecalle de 3 mm por donde se inserte la pasta de juntas. Este sistema no utiliza cinta de papel. La pasta de juntas se aplica en las cavidades de las placas y una masilla elástica en los encuentros. Suspendido mediante una estructura simple de perfiles TC47 en acero galvanizado de 0,6 mm de espesor con modulación de 400 mm entre ejes y unidos al forjado mediante varilla roscada galvanizada y horquilla TC47. Incluida la parte proporcional del resto de materiales: tornillería, pasta de juntas, masilla para encuentros perimetrales, fijaciones, junta estanca, etc. Montaje según norma de instalación UNE 102043 y exigencias del CTE.","Techo continuo formado por una placa RESIST de 15 mm de espesor compuesta por yeso natural, fibra de vidrio y aditivos inorgánicos que le aportan alta dureza y resistencia mecánica. Con mayor cantidad de fibra de vidrio y dosificación modificada, aumenta su densidad, mejorando notablemente la resistencia mecánica. Idónea para lugares con altas exigencias en cuanto a deterioro y desgaste. Reacción al fuego: EUROCLASE A1. Sistema de galces desiguales: las placas encajan entre ellas dejando una entrecalle de 3 mm por donde se inserte la pasta de juntas. Este sistema no utiliza cinta de papel. La pasta de juntas se aplica en las cavidades de las placas y una masilla elástica en los encuentros. Suspendido mediante una estructura simple de perfiles TC47 en acero galvanizado de 0,6 mm de espesor con modulación de 400 mm entre ejes y unidos al forjado mediante varilla roscada galvanizada y horquilla TC47. Incluida la parte proporcional del resto de materiales: tornillería, pasta de juntas, masilla para encuentros perimetrales, fijaciones, junta estanca, etc. Montaje según norma de instalación UNE 102043 y exigencias del CTE.","Techo continuo formado por una placa HIDROPLUS de 15 mm de espesor compuesta por yeso natural, fibra de vidrio y aditivos inorgánicos que le aportan alta dureza y resistencia mecánica. Incorpora tratamiento hidrófugo y un aumento en su densidad, características claves para una elevada resistencia a la humedad (absorción de agua menor al 3%) y una gran resistencia mecánica. Idónea para zonas de intemperie. Reacción al fuego: EUROCLASE A1. Sistema de galces desiguales: las placas encajan entre ellas dejando una entrecalle de 3 mm por donde se inserte la pasta de juntas. Este sistema no utiliza cinta de papel. La pasta de juntas se aplica en las cavidades de las placas y una masilla elástica en los encuentros. Suspendido mediante una estructura simple de perfiles TC47 en acero galvanizado de 0,6 mm de espesor con modulación de 400 mm entre ejes y unidos al forjado mediante varilla roscada galvanizada y horquilla TC47. Incluida la parte proporcional del resto de materiales: tornillería, pasta de juntas, masilla para encuentros perimetrales, fijaciones, junta estanca, etc. Montaje según norma de instalación UNE 102043 y exigencias del CTE.","Techo continuo formado por una placa SUPREM de 15 mm de espesor compuesta por yeso natural, fibra de vidrio y aditivos inorgánicos que le aportan alta dureza y resistencia mecánica. Incorpora tratamiento hidrófugo, perlita y un aumento en la densidad para conseguir soluciones constructivas que cumplan, altos requisitos frente al fuego y una capacidad reducida de absorción de agua. Reacción al fuego: EUROCLASE A1. Sistema de galces desiguales: las placas encajan entre ellas dejando una entrecalle de 3 mm por donde se inserte la pasta de juntas. Este sistema no utiliza cinta de papel. La pasta de juntas se aplica en las cavidades de las placas y una masilla elástica en los encuentros. Suspendido mediante una estructura simple de perfiles TC47 en acero galvanizado de 0,6 mm de espesor con modulación de 400 mm entre ejes y unidos al forjado mediante varilla roscada galvanizada y horquilla TC47. Incluida la parte proporcional del resto de materiales: tornillería, pasta de juntas, masilla para encuentros perimetrales, fijaciones, junta estanca, etc. Montaje según norma de instalación UNE 102043 y exigencias del CTE."]
{"$rows_left_out":23}
{"sheet":"Estructura simple una placa","index":6,"n_rows":149,"n_cols":60,"rows_kept":149,"cut":false,"hidden":false,"merged":[[37,38,38,42],[37,14,37,16],[47,9,48,9],[47,10,48,10],[47,8,48,8],[6,2,6,51],[25,28,25,29],[25,24,25,27],[25,20,25,21],[25,56,26,56],[25,52,25,55],[25,12,25,14],[25,15,25,16],[25,17,25,19],[25,36,25,37],[25,38,25,39]]}
[null,null,"                     RENDIMIENTOS"]
[null,null,"                     PEDIDO MATERIALES"]
[null,null,"                     PRESUPUESTO"]
[null,null,"                     LISTA DE MATERIALES"]
[null,null,null,{"$f":"VLOOKUP(BE36,'Índice sistemas'!C5:E18,3,FALSE)","v":"TECHO SIMPLE / ESTRUCTURA SIMPLE ATT® 47 / 600 1x13 "},null,null,null,null,null,null,null,null,{"$f":"$D$5","v":"TECHO SIMPLE / ESTRUCTURA SIMPLE ATT® 47 / 600 1x13 "},null,null,null,null,null,null,null,{"$f":"$D$5","v":"TECHO SIMPLE / ESTRUCTURA SIMPLE ATT® 47 / 600 1x13 "},null,null,null,null,null,null,null,{"$f":"$D$5","v":"TECHO SIMPLE / ESTRUCTURA SIMPLE ATT® 47 / 600 1x13 "},null,null,null,null,null,null,null,{"$f":"AC5","v":"TECHO SIMPLE / ESTRUCTURA SIMPLE ATT® 47 / 600 1x13 "},null,null,null,null,null,null,null,{"$f":"AK5","v":"TECHO SIMPLE / ESTRUCTURA SIMPLE ATT® 47 / 600 1x13 "}]
[]
{"$rows_left_out":144}
{"sheet":"Estructura simple dos placas","index":7,"n_rows":150,"n_cols":60,"rows_kept":150,"cut":false,"hidden":false,"merged":[[6,2,6,51],[25,12,25,14],[25,15,25,16],[25,17,25,19],[25,20,25,21],[25,24,25,27],[25,28,25,29],[25,36,25,37],[25,38,25,39],[25,52,25,55],[25,56,26,56],[38,14,38,16],[38,38,39,42],[48,8,49,8],[48,9,49,9],[48,10,49,10]]}
[null,null,"                     RENDIMIENTOS"]
[null,null,"                     PEDIDO MATERIALES"]
[null,null,"                     PRESUPUESTO"]
[null,null,"                     LISTA DE MATERIALES"]
[null,null,null,{"$f":"VLOOKUP(BE37,'Índice sistemas'!C5:E28,3,FALSE)","v":"TECHO DOBLE / ESTRUCTURA SIMPLE ATT® 47 / 600 2x13 "},null,null,null,null,null,null,null,null,{"$f":"$D$5","v":"TECHO DOBLE / ESTRUCTURA SIMPLE ATT® 47 / 600 2x13 "},null,null,null,null,null,null,null,{"$f":"$D$5","v":"TECHO DOBLE / ESTRUCTURA SIMPLE ATT® 47 / 600 2x13 "},null,null,null,null,null,null,null,{"$f":"$D$5","v":"TECHO DOBLE / ESTRUCTURA SIMPLE ATT® 47 / 600 2x13 "},null,null,null,null,null,null,null,{"$f":"AC5","v":"TECHO DOBLE / ESTRUCTURA SIMPLE ATT® 47 / 600 2x13 "},null,null,null,null,null,null,null,{"$f":"AK5","v":"TECHO DOBLE / ESTRUCTURA SIMPLE ATT® 47 / 600 2x13 "}]
[]
{"$rows_left_out":144}